Target
Coagulation factor X
Ligand
BDBM50113590
Substrate
Meas. Tech.
ChEMBL_69679 (CHEMBL682017)
IC50
0.500000±n/a nM
Citation
 Song, YClizbe, LBhakta, CTeng, WLi, WWu, YJia, ZJZhang, PWang, LDoughan, BSu, TKanter, JWoolfrey, JWong, PHuang, BTran, KSinha, UPark, GReed, AMalinowski, JHollenbach, SScarborough, RMZhu, BY Design, synthesis, and SAR of substituted acrylamides as factor Xa inhibitors. Bioorg Med Chem Lett 12:1511-5 (2002)  
Target
Name:
Coagulation factor X
Synonyms:
Activated coagulation factor X (FXa) Coagulation factor X precursor F10 Factor X heavy chain Factor Xa Stuart-Prower factor
Type:
Enzyme
Mol. Mass.:
54726.60
Organism:
Homo sapiens (Human)
Description:
Residue:
488
  
Inhibitor
Name:
BDBM50113590
Synonyms:
(E)-3-(3-Carbamimidoyl-phenyl)-2-fluoro-but-2-enoic acid (3-bromo-2'-sulfamoyl-biphenyl-4-yl)-amide CHEMBL288232
Type:
Small organic molecule
Emp. Form.:
C23H20BrFN4O3S
Mol. Mass.:
531.397
SMILES:
C\C(=C(/F)C(=O)Nc1ccc(cc1Br)-c1ccccc1S(N)(=O)=O)c1cccc(c1)C(N)=N
: