Target
Retinoic acid receptor beta
Ligand
BDBM50120063
Substrate
Meas. Tech.
ChEBML_39041
EC50
>1000±n/a nM
Citation
 Beard, RLDuong, TTTeng, MKlein, ESStandevan, AMChandraratna, RA Synthesis and biological activity of retinoic acid receptor-alpha specific amides. Bioorg Med Chem Lett 12:3145-8 (2002)  
Target
Name:
Retinoic acid receptor beta
Synonyms:
HAP NR1B2 RAR-beta RARB Retinoic acid receptor RXR-alpha/Retinoic acid receptor beta Retinoid receptor
Type:
PROTEIN
Mol. Mass.:
50498.70
Organism:
Homo sapiens (Human)
Description:
ChEMBL_1458015
Residue:
455
  
Inhibitor
Name:
BDBM50120063
Synonyms:
2,6-Difluoro-4-[(3-hydroxy-5,5,8,8-tetramethyl-5,6,7,8-tetrahydro-naphthalene-2-carbonyl)-amino]-benzoic acid | CHEMBL107054
Type:
Small organic molecule
Emp. Form.:
C22H23F2NO4
Mol. Mass.:
403.4191
SMILES:
CC1(C)CCC(C)(C)c2cc(C(=O)Nc3cc(F)c(C(O)=O)c(F)c3)c(O)cc12
: