Target
Retinoic acid receptor beta
Ligand
BDBM50120066
Substrate
Meas. Tech.
ChEMBL_39041 (CHEMBL652855)
Kd
380±n/a nM
Citation
 Beard, RLDuong, TTTeng, MKlein, ESStandevan, AMChandraratna, RA Synthesis and biological activity of retinoic acid receptor-alpha specific amides. Bioorg Med Chem Lett 12:3145-8 (2002)  
Target
Name:
Retinoic acid receptor beta
Synonyms:
HAP NR1B2 RAR-beta RARB Retinoic acid receptor RXR-alpha/Retinoic acid receptor beta Retinoid receptor
Type:
PROTEIN
Mol. Mass.:
50498.70
Organism:
Homo sapiens (Human)
Description:
ChEMBL_1458015
Residue:
455
  
Inhibitor
Name:
BDBM50120066
Synonyms:
2-Fluoro-4-[(5,5,8,8-tetramethyl-5,6,7,8-tetrahydro-naphthalene-2-carbonyl)-amino]-benzoic acid | CHEMBL326911
Type:
Small organic molecule
Emp. Form.:
C22H24FNO3
Mol. Mass.:
369.4293
SMILES:
CC1(C)CCC(C)(C)c2cc(ccc12)C(=O)Nc1ccc(C(O)=O)c(F)c1
: