Target
Estrogen receptor
Ligand
BDBM50106635
Substrate
Meas. Tech.
ChEMBL_2063902 (CHEMBL4719155)
EC50
2390±n/a nM
Citation
 Yonekubo, SFushimi, NMiyagi, TNakanishi, OKatsuno, KOzawa, MHanda, CFuruya, NMuranaka, H Synthesis and structure-activity relationships of 1-benzylindane derivatives as selective agonists for estrogen receptor beta. Bioorg Med Chem 24:5895-5910 (2016)  
Target
Name:
Estrogen receptor
Synonyms:
ER ESR ESR1_HUMAN Estrogen receptor Estrogen receptor (ER-alpha) Estrogen receptor alpha (ER) Nuclear receptor subfamily 3 group A member 1
Type:
Protein
Mol. Mass.:
66230.44
Organism:
Homo sapiens (Human)
Description:
P03372
Residue:
595
  
Inhibitor
Name:
BDBM50106635
Synonyms:
(+/-)-2,3-bis(4-hydroxyphenyl)propanenitrile 2,3-bis(4-hydroxyphenyl)propanenitrile DIARYLPROPIONITRILE
Type:
Small organic molecule
Emp. Form.:
C15H13NO2
Mol. Mass.:
239.2692
SMILES:
Oc1ccc(CC(C#N)c2ccc(O)cc2)cc1
: