Target
N-formyl peptide receptor 2
Ligand
BDBM50559811
Substrate
Meas. Tech.
ChEMBL_2070440 (CHEMBL4725974)
EC50
0.110000±n/a nM
Citation
 Asahina, YWurtz, NRArakawa, KCarson, NFujii, KFukuchi, KGarcia, RHsu, MYIshiyama, JIto, BKick, ELupisella, JMatsushima, SOhata, KOstrowski, JSaito, YTsuda, KVillarreal, FYamada, HYamaoka, TWexler, RGordon, DKohno, Y Discovery of BMS-986235/LAR-1219: A Potent Formyl Peptide Receptor 2 (FPR2) Selective Agonist for the Prevention of Heart Failure. J Med Chem 63:9003-9019 (2020)  
Target
Name:
N-formyl peptide receptor 2
Synonyms:
ALXR, FPRL1, FPR2 FPR2 FPRH1 Formyl Peptide Receptor-Like 1 LXA4 receptor Lipoxin A4 receptor RFP | hFPRL
Type:
G Protein-Coupled Receptor (GPCR)
Mol. Mass.:
38968.35
Organism:
Homo sapiens (Human)
Description:
P25090
Residue:
351
  
Inhibitor
Name:
BDBM50559811
Synonyms:
CHEMBL4784400
Type:
Small organic molecule
Emp. Form.:
C19H20ClN3O3
Mol. Mass.:
373.833
SMILES:
COc1ccc(cc1)[C@@H]1CCNC(=O)[C@H]1NC(=O)Nc1ccc(Cl)cc1
: