Target
N-formyl peptide receptor 2
Ligand
BDBM50559822
Substrate
Meas. Tech.
ChEMBL_2070440 (CHEMBL4725974)
EC50
0.360000±n/a nM
Citation
 Asahina, YWurtz, NRArakawa, KCarson, NFujii, KFukuchi, KGarcia, RHsu, MYIshiyama, JIto, BKick, ELupisella, JMatsushima, SOhata, KOstrowski, JSaito, YTsuda, KVillarreal, FYamada, HYamaoka, TWexler, RGordon, DKohno, Y Discovery of BMS-986235/LAR-1219: A Potent Formyl Peptide Receptor 2 (FPR2) Selective Agonist for the Prevention of Heart Failure. J Med Chem 63:9003-9019 (2020)  
Target
Name:
N-formyl peptide receptor 2
Synonyms:
ALXR, FPRL1, FPR2 FPR2 FPRH1 Formyl Peptide Receptor-Like 1 LXA4 receptor Lipoxin A4 receptor RFP | hFPRL
Type:
G Protein-Coupled Receptor (GPCR)
Mol. Mass.:
38968.35
Organism:
Homo sapiens (Human)
Description:
P25090
Residue:
351
  
Inhibitor
Name:
BDBM50559822
Synonyms:
CHEMBL4753713
Type:
Small organic molecule
Emp. Form.:
C17H16F2N4O3
Mol. Mass.:
362.3307
SMILES:
COc1cnc([C@@H]2CNC(=O)[C@H]2NC(=O)Nc2ccc(F)cc2)c(F)c1
: