Target
Calpain-1 catalytic subunit
Ligand
BDBM50124010
Substrate
Meas. Tech.
ChEMBL_139013 (CHEMBL744609)
IC50
7.5±n/a nM
Citation
 Inoue, JNakamura, MCui, YSSakai, YSakai, OHill, JRWang, KKYuen, PW Structure-activity relationship study and drug profile of N-(4-fluorophenylsulfonyl)-L-valyl-L-leucinal (SJA6017) as a potent calpain inhibitor. J Med Chem 46:868-71 (2003)  
Target
Name:
Calpain-1 catalytic subunit
Synonyms:
CAN1_HUMAN CAPN1 Calpain-1 (u-Calpain) Calpain1
Type:
Protein
Mol. Mass.:
81880.51
Organism:
Homo sapiens (Human)
Description:
Residue:
714
  
Inhibitor
Name:
BDBM50124010
Synonyms:
2-(4-Fluoro-benzenesulfonylamino)-N-(1-formyl-3-methyl-butyl)-3-methyl-butyramide | CHEMBL168471
Type:
Small organic molecule
Emp. Form.:
C17H25FN2O4S
Mol. Mass.:
372.455
SMILES:
CC(C)C[C@@H](NC(=O)[C@@H](NS(=O)(=O)c1ccc(F)cc1)C(C)C)C=O
: