Target
Glutamate receptor 1
Ligand
BDBM50126763
Substrate
Meas. Tech.
ChEMBL_90138 (CHEMBL884410)
EC50
22000±n/a nM
Citation
 Brehm, LGreenwood, JRHansen, KBNielsen, BEgebjerg, JStensbøl, TBBräuner-Osborne, HSløk, FAKronborg, TTKrogsgaard-Larsen, P (S)-2-Amino-3-(3-hydroxy-7,8-dihydro-6H-cyclohepta[d]isoxazol-4-yl)propionic acid, a potent and selective agonist at the GluR5 subtype of ionotropic glutamate receptors. Synthesis, modeling, and molecular pharmacology. J Med Chem 46:1350-8 (2003)  
Target
Name:
Glutamate receptor 1
Synonyms:
AMPA-selective glutamate receptor 1 GLUR1 GRIA1_HUMAN GluR-A Glutamate AMPA 1 Glutamate receptor AMPA 1/2 Glutamate receptor ionotropic, AMPA 1
Type:
Enzyme Catalytic Domain
Mol. Mass.:
101512.92
Organism:
Homo sapiens (Human)
Description:
Glutamate AMPA 1 GRIA1 HUMAN::P42261
Residue:
906
  
Inhibitor
Name:
BDBM50126763
Synonyms:
(S)-2-amino-3-(3-hydroxy-5-tert-butyl-4-isoxazolyl)propionic acid CHEMBL27130
Type:
Small organic molecule
Emp. Form.:
C10H16N2O4
Mol. Mass.:
228.245
SMILES:
CC(C)(C)c1o[nH]c(=O)c1C[C@H](N)C(O)=O
: