Target
Aldo-keto reductase family 1 member A1
Ligand
BDBM16312
Substrate
Meas. Tech.
ChEMBL_31327 (CHEMBL644880)
IC50
29±n/a nM
Citation
 Da Settimo, FPrimofiore, GDa Settimo, ALa Motta, CSimorini, FNovellino, EGreco, GLavecchia, ABoldrini, E Novel, highly potent aldose reductase inhibitors: cyano(2-oxo-2,3-dihydroindol-3-yl)acetic acid derivatives. J Med Chem 46:1419-28 (2003)  
Target
Name:
Aldo-keto reductase family 1 member A1
Synonyms:
AK1A1_RAT Aldehyde reductase | Alr
Type:
PROTEIN
Mol. Mass.:
36509.97
Organism:
Rattus norvegicus
Description:
ChEMBL_31321
Residue:
325
  
Inhibitor
Name:
BDBM16312
Synonyms:
(4S)-6-fluoro-2,3-dihydrospiro[1-benzopyran-4,4'-imidazolidine]-2',5'-dione Sorbinil
Type:
Small organic molecule
Emp. Form.:
C11H9FN2O3
Mol. Mass.:
236.1992
SMILES:
Fc1ccc2OCC[C@]3(NC(=O)NC3=O)c2c1
: