Target
Aldo-keto reductase family 1 member A1
Ligand
BDBM50126780
Substrate
Meas. Tech.
ChEMBL_31327 (CHEMBL644880)
IC50
690.0±n/a nM
Citation
 Da Settimo, FPrimofiore, GDa Settimo, ALa Motta, CSimorini, FNovellino, EGreco, GLavecchia, ABoldrini, E Novel, highly potent aldose reductase inhibitors: cyano(2-oxo-2,3-dihydroindol-3-yl)acetic acid derivatives. J Med Chem 46:1419-28 (2003)  
Target
Name:
Aldo-keto reductase family 1 member A1
Synonyms:
AK1A1_RAT Aldehyde reductase | Alr
Type:
PROTEIN
Mol. Mass.:
36509.97
Organism:
Rattus norvegicus
Description:
ChEMBL_31321
Residue:
325
  
Inhibitor
Name:
BDBM50126780
Synonyms:
CHEMBL30993 | Cyano-[5-fluoro-1-(4-methyl-benzyl)-2-oxo-2,3-dihydro-1H-indol-3-yl]-acetic acid
Type:
Small organic molecule
Emp. Form.:
C19H15FN2O3
Mol. Mass.:
338.3324
SMILES:
Cc1ccc(CN2C(=O)C(C(C#N)C(O)=O)c3cc(F)ccc23)cc1
: