Target
Adenylate cyclase type 5
Ligand
BDBM50128189
Substrate
Meas. Tech.
ChEMBL_31884 (CHEMBL645674)
IC50
>100000±n/a nM
Citation
 Levy, DEBao, MCherbavaz, DBTomlinson, JESedlock, DMHomcy, CJScarborough, RM Metal coordination-based inhibitors of adenylyl cyclase: novel potent P-site antagonists. J Med Chem 46:2177-86 (2003)  
Target
Name:
Adenylate cyclase type 5
Synonyms:
ADCY5 Adenylate cyclase | Adenylate cyclase type V
Type:
PROTEIN
Mol. Mass.:
138919.21
Organism:
Homo sapiens (Human)
Description:
ChEMBL_31732
Residue:
1261
  
Inhibitor
Name:
BDBM50128189
Synonyms:
(1S,3S)-[3-(6-Amino-purin-9-yl)-cyclopentyl]-acetic acid | CHEMBL302927
Type:
Small organic molecule
Emp. Form.:
C12H15N5O2
Mol. Mass.:
261.2798
SMILES:
Nc1ncnc2n(cnc12)[C@H]1CC[C@H](CC(O)=O)C1
: