Target
Adenylate cyclase type 5
Ligand
BDBM50119832
Substrate
Meas. Tech.
ChEMBL_31884 (CHEMBL645674)
IC50
7900±n/a nM
Citation
 Levy, DEBao, MCherbavaz, DBTomlinson, JESedlock, DMHomcy, CJScarborough, RM Metal coordination-based inhibitors of adenylyl cyclase: novel potent P-site antagonists. J Med Chem 46:2177-86 (2003)  
Target
Name:
Adenylate cyclase type 5
Synonyms:
ADCY5 Adenylate cyclase | Adenylate cyclase type V
Type:
PROTEIN
Mol. Mass.:
138919.21
Organism:
Homo sapiens (Human)
Description:
ChEMBL_31732
Residue:
1261
  
Inhibitor
Name:
BDBM50119832
Synonyms:
4-(6-Amino-purin-9-yl)-N-hydroxy-butyramide | CHEMBL302708
Type:
Small organic molecule
Emp. Form.:
C9H12N6O2
Mol. Mass.:
236.2306
SMILES:
Nc1ncnc2n(CCCC(=O)NO)cnc12
: