Target
Adenylate cyclase type 5
Ligand
BDBM50128204
Substrate
Meas. Tech.
ChEMBL_31884 (CHEMBL645674)
IC50
16300±n/a nM
Citation
 Levy, DEBao, MCherbavaz, DBTomlinson, JESedlock, DMHomcy, CJScarborough, RM Metal coordination-based inhibitors of adenylyl cyclase: novel potent P-site antagonists. J Med Chem 46:2177-86 (2003)  
Target
Name:
Adenylate cyclase type 5
Synonyms:
ADCY5 Adenylate cyclase | Adenylate cyclase type V
Type:
PROTEIN
Mol. Mass.:
138919.21
Organism:
Homo sapiens (Human)
Description:
ChEMBL_31732
Residue:
1261
  
Inhibitor
Name:
BDBM50128204
Synonyms:
(1R,3R)-2-[4-(6-Amino-purin-9-yl)-cyclopent-2-enyl]-N-hydroxy-acetamide | CHEMBL304759
Type:
Small organic molecule
Emp. Form.:
C12H14N6O2
Mol. Mass.:
274.2786
SMILES:
Nc1ncnc2n(cnc12)[C@@H]1C[C@H](CC(=O)NO)C=C1
: