Target
Adenylate cyclase type 5
Ligand
BDBM50128210
Substrate
Meas. Tech.
ChEMBL_31884 (CHEMBL645674)
IC50
600±n/a nM
Citation
 Levy, DEBao, MCherbavaz, DBTomlinson, JESedlock, DMHomcy, CJScarborough, RM Metal coordination-based inhibitors of adenylyl cyclase: novel potent P-site antagonists. J Med Chem 46:2177-86 (2003)  
Target
Name:
Adenylate cyclase type 5
Synonyms:
ADCY5 Adenylate cyclase | Adenylate cyclase type V
Type:
PROTEIN
Mol. Mass.:
138919.21
Organism:
Homo sapiens (Human)
Description:
ChEMBL_31732
Residue:
1261
  
Inhibitor
Name:
BDBM50128210
Synonyms:
(1R,3R)-2-[3-(6-Amino-purin-9-yl)-cyclopentyl]-N-hydroxy-acetamide | CHEMBL69184
Type:
Small organic molecule
Emp. Form.:
C12H16N6O2
Mol. Mass.:
276.2944
SMILES:
Nc1ncnc2n(cnc12)[C@@H]1CC[C@@H](CC(=O)NO)C1
: