Target
5'-AMP-activated protein kinase catalytic subunit alpha-2
Ligand
BDBM50564454
Substrate
Meas. Tech.
ChEMBL_2087842 (CHEMBL4769105)
IC50
84±n/a nM
Citation
 Matheson, CJCasalvieri, KABackos, DSMinhajuddin, MJordan, CTReigan, P Substituted oxindol-3-ylidenes as AMP-activated protein kinase (AMPK) inhibitors. Eur J Med Chem 197:0 (2020)  
Target
Name:
5'-AMP-activated protein kinase catalytic subunit alpha-2
Synonyms:
AAPK2_HUMAN AMP-activated protein kinase, alpha-2 subunit AMPK subunit alpha-2 AMPK2 Hydroxymethylglutaryl-CoA reductase kinase | PRKAA2
Type:
Enzyme
Mol. Mass.:
62331.02
Organism:
Homo sapiens (Human)
Description:
P54646
Residue:
552
  
Inhibitor
Name:
BDBM50564454
Synonyms:
CHEMBL4792246
Type:
Small organic molecule
Emp. Form.:
C24H32N6O3
Mol. Mass.:
452.5493
SMILES:
CCN(CC)CCNC(=O)c1c(C)[nH]c(\C=C2/C(=O)Nc3ccc(CNC(N)=O)cc23)c1C
: