Target
Neutral ceramidase
Ligand
BDBM50569052
Substrate
Meas. Tech.
ChEMBL_2107518 (CHEMBL4816193)
IC50
18±n/a nM
Citation
 Bielsa, NCasasampere, MAseeri, MCasas, JDelgado, AAbad, JLFabriās, G Discovery of deoxyceramide analogs as highly selective ACER3 inhibitors in live cells. Eur J Med Chem 216:0 (2021)  
Target
Name:
Neutral ceramidase
Synonyms:
ASAH2 Acylsphingosine deacylase 2 HNAC1 N-CDase NCDase Non-lysosomal ceramidase | hCD
Type:
PROTEIN
Mol. Mass.:
85523.37
Organism:
Homo sapiens (Human)
Description:
ChEMBL_947546
Residue:
780
  
Inhibitor
Name:
BDBM50569052
Synonyms:
CHEMBL4866400
Type:
Small organic molecule
Emp. Form.:
C25H50N2O3
Mol. Mass.:
426.6761
SMILES:
CCCCCCCCCCCCC\C=C\[C@@H](O)[C@H](CO)NC(=O)NCCCCCC
: