Target
Telomerase reverse transcriptase
Ligand
BDBM50134030
Substrate
Meas. Tech.
ChEMBL_210064 (CHEMBL813588)
EC50
115±n/a nM
Citation
 Harrison, RJCuesta, JChessari, GRead, MABasra, SKReszka, APMorrell, JGowan, SMIncles, CMTanious, FAWilson, WDKelland, LRNeidle, S Trisubstituted acridine derivatives as potent and selective telomerase inhibitors. J Med Chem 46:4463-76 (2003)  
Target
Name:
Telomerase reverse transcriptase
Synonyms:
EST2 TERT TRT
Type:
PROTEIN
Mol. Mass.:
127099.03
Organism:
Homo sapiens (Human)
Description:
ChEMBL_1447029
Residue:
1132
  
Inhibitor
Name:
BDBM50134030
Synonyms:
9-[4-(N,N-dimethylamino)phenylamino]-3,6-bis(3-pyrrolodinopropionamido) acridine N,N'-(9-{[4-(dimethylamino)phenyl]amino}acridine-3,6-diyl)bis(3-pyrrolidin-1-ylpropanamide)
Type:
Small organic molecule
Emp. Form.:
C35H43N7O2
Mol. Mass.:
593.7616
SMILES:
CN(C)c1ccc(Nc2c3ccc(NC(=O)CCN4CCCC4)cc3nc3cc(NC(=O)CCN4CCCC4)ccc23)cc1
: