Target
Heat shock protein HSP 90-alpha
Ligand
BDBM227589
Substrate
Meas. Tech.
ChEMBL_2112072 (CHEMBL4820922)
Kd
1.8±n/a nM
Citation
 Bellone, MLMuņoz Camero, CChini, MGDal Piaz, FHernandez, VBifulco, GDe Tommasi, NBraca, A Limonoids from  J Nat Prod 84:724-737 (2021)  
Target
Name:
Heat shock protein HSP 90-alpha
Synonyms:
HS90A_HUMAN HSP86 HSP90AA1 HSPCA Heat shock 86 kDa Heat shock protein HSP 90-alpha (HSP90) LAP-2 Lipopolysaccharide-associated protein 2 heat shock protein 90kDa alpha (cytosolic), class A member 1 isoform 2
Type:
Molecular Chaperone
Mol. Mass.:
84623.45
Organism:
Homo sapiens (Human)
Description:
P07900
Residue:
732
  
Inhibitor
Name:
BDBM227589
Synonyms:
Radicicol
Type:
Small organic molecule
Emp. Form.:
C18H17ClO6
Mol. Mass.:
364.777
SMILES:
C[C@@H]1C[C@H]2O[C@@H]2\C=C/C=C/C(=O)Cc2c(Cl)c(O)cc(O)c2C(=O)O1
: