Target
Peroxisome proliferator-activated receptor alpha
Ligand
BDBM28700
Substrate
Meas. Tech.
ChEMBL_153718 (CHEMBL762046)
EC50
13000±n/a nM
Citation
 Xu, YMayhugh, DSaeed, AWang, XThompson, RCDominianni, SJKauffman, RFSingh, JBean, JSBensch, WRBarr, RJOsborne, JMontrose-Rafizadeh, CZink, RWYumibe, NPHuang, NLuffer-Atlas, DRungta, DMaise, DEMantlo, NB Design and synthesis of a potent and selective triazolone-based peroxisome proliferator-activated receptor alpha agonist. J Med Chem 46:5121-4 (2003)  
Target
Name:
Peroxisome proliferator-activated receptor alpha
Synonyms:
NR1C1 PPAR PPAR-alpha PPARA_HUMAN Peroxisome proliferator-activated receptor | Peroxisome proliferator-activated receptor alpha (PPAR alpha)
Type:
Enzyme
Mol. Mass.:
52222.08
Organism:
Homo sapiens (Human)
Description:
Q07869
Residue:
468
  
Inhibitor
Name:
BDBM28700
Synonyms:
2-(4-(4-Chlorobenzoyl)phenoxy)-2-methylpropionic acid CHEMBL981 FIBRICOR LF 153 procetofenic acid
Type:
Small organic molecule
Emp. Form.:
C17H15ClO4
Mol. Mass.:
318.752
SMILES:
CC(C)(Oc1ccc(cc1)C(=O)c1ccc(Cl)cc1)C(O)=O
: