Target
Nuclear receptor ROR-gamma
Ligand
BDBM50572708
Substrate
Meas. Tech.
ChEMBL_2117951 (CHEMBL4827017)
EC50
220±n/a nM
Citation
 Ma, XSun, NLi, XFu, W Discovery of novel N-sulfonamide-tetrahydroisoquinolines as potent retinoic acid receptor-related orphan receptor ?t agonists. Eur J Med Chem 222:0 (2021)  
Target
Name:
Nuclear receptor ROR-gamma
Synonyms:
Nr1f3 Nuclear receptor subfamily 1 group F member 3 RORG_MOUSE Rorc TOR Thymus orphan receptor
Type:
PROTEIN
Mol. Mass.:
58133.31
Organism:
Mus musculus
Description:
ChEMBL_103664
Residue:
516
  
Inhibitor
Name:
BDBM50572708
Synonyms:
CHEMBL4851155
Type:
Small organic molecule
Emp. Form.:
C23H28ClFN4O3S
Mol. Mass.:
495.01
SMILES:
CN(Cc1c(F)cccc1Cl)S(=O)(=O)N1CCc2cc(ccc2C1)N1CCN(CC1)C(C)=O
: