Target
Histone deacetylase 2b
Ligand
BDBM50139952
Substrate
Meas. Tech.
ChEMBL_87549 (CHEMBL695147)
IC50
43±n/a nM
Citation
 Mai, AMassa, SCerbara, IValente, SRagno, RBottoni, PScatena, RLoidl, PBrosch, G 3-(4-Aroyl-1-methyl-1H-2-pyrrolyl)-N-hydroxy-2-propenamides as a new class of synthetic histone deacetylase inhibitors. 2. Effect of pyrrole-C2 and/or -C4 substitutions on biological activity. J Med Chem 47:1098-109 (2004)  
Target
Name:
Histone deacetylase 2b
Synonyms:
Histone deacetylase HD2
Type:
PROTEIN
Mol. Mass.:
30785.07
Organism:
Zea mays
Description:
ChEMBL_87549
Residue:
286
  
Inhibitor
Name:
BDBM50139952
Synonyms:
CHEMBL268286 | N-Hydroxy-3-[1-methyl-4-(3-phenyl-propionyl)-1H-pyrrol-2-yl]-acrylamide
Type:
Small organic molecule
Emp. Form.:
C17H18N2O3
Mol. Mass.:
298.3364
SMILES:
Cn1cc(cc1C=CC(=O)NO)C(=O)CCc1ccccc1
: