Target
Histone deacetylase 2b
Ligand
BDBM50139930
Substrate
Meas. Tech.
ChEMBL_87717 (CHEMBL857174)
IC50
200±n/a nM
Citation
 Mai, AMassa, SCerbara, IValente, SRagno, RBottoni, PScatena, RLoidl, PBrosch, G 3-(4-Aroyl-1-methyl-1H-2-pyrrolyl)-N-hydroxy-2-propenamides as a new class of synthetic histone deacetylase inhibitors. 2. Effect of pyrrole-C2 and/or -C4 substitutions on biological activity. J Med Chem 47:1098-109 (2004)  
Target
Name:
Histone deacetylase 2b
Synonyms:
Histone deacetylase HD2
Type:
PROTEIN
Mol. Mass.:
30785.07
Organism:
Zea mays
Description:
ChEMBL_87549
Residue:
286
  
Inhibitor
Name:
BDBM50139930
Synonyms:
CHEMBL269230 | N,N'-Dihydroxy-2-(1-methyl-4-phenylacetyl-1H-pyrrol-2-ylmethylene)-malonamide
Type:
Small organic molecule
Emp. Form.:
C17H17N3O5
Mol. Mass.:
343.334
SMILES:
[#6]-n1cc(cc1\[#6]=[#6](\[#6](=O)-[#7]-[#8])-[#6](=O)-[#7]-[#8])-[#6](=O)-[#6]-c1ccccc1
: