Target
Histone deacetylase 2b
Ligand
BDBM19130
Substrate
Meas. Tech.
ChEMBL_87549 (CHEMBL695147)
IC50
7.2±n/a nM
Citation
 Mai, AMassa, SCerbara, IValente, SRagno, RBottoni, PScatena, RLoidl, PBrosch, G 3-(4-Aroyl-1-methyl-1H-2-pyrrolyl)-N-hydroxy-2-propenamides as a new class of synthetic histone deacetylase inhibitors. 2. Effect of pyrrole-C2 and/or -C4 substitutions on biological activity. J Med Chem 47:1098-109 (2004)  
Target
Name:
Histone deacetylase 2b
Synonyms:
Histone deacetylase HD2
Type:
PROTEIN
Mol. Mass.:
30785.07
Organism:
Zea mays
Description:
ChEMBL_87549
Residue:
286
  
Inhibitor
Name:
BDBM19130
Synonyms:
(2E,4E,6R)-7-[4-(dimethylamino)phenyl]-N-hydroxy-4,6-dimethyl-7-oxohepta-2,4-dienamide TSA | Trichostatin A (TSA)
Type:
Small organic molecule
Emp. Form.:
C17H22N2O3
Mol. Mass.:
302.3682
SMILES:
CC(C=CC(=O)NO)C=C(C)C(=O)c1ccc(cc1)N(C)C
: