Target
Histone deacetylase 1
Ligand
BDBM19130
Substrate
Meas. Tech.
ChEMBL_87871 (CHEMBL697293)
IC50
2.0±n/a nM
Citation
 Ragno, RMai, AMassa, SCerbara, IValente, SBottoni, PScatena, RJesacher, FLoidl, PBrosch, G 3-(4-Aroyl-1-methyl-1H-pyrrol-2-yl)-N-hydroxy-2-propenamides as a new class of synthetic histone deacetylase inhibitors. 3. Discovery of novel lead compounds through structure-based drug design and docking studies. J Med Chem 47:1351-9 (2004)  
Target
Name:
Histone deacetylase 1
Synonyms:
HD1 Hdac1 | Histone deacetylase 1/2
Type:
Protein
Mol. Mass.:
55062.26
Organism:
Mus musculus (Mouse)
Description:
O09106
Residue:
482
  
Inhibitor
Name:
BDBM19130
Synonyms:
(2E,4E,6R)-7-[4-(dimethylamino)phenyl]-N-hydroxy-4,6-dimethyl-7-oxohepta-2,4-dienamide TSA | Trichostatin A (TSA)
Type:
Small organic molecule
Emp. Form.:
C17H22N2O3
Mol. Mass.:
302.3682
SMILES:
CC(C=CC(=O)NO)C=C(C)C(=O)c1ccc(cc1)N(C)C
: