Target
Dihydroorotate dehydrogenase (quinone), mitochondrial
Ligand
BDBM50576022
Substrate
Meas. Tech.
ChEMBL_2126308 (CHEMBL4835653)
IC50
5000±n/a nM
Target
Name:
Dihydroorotate dehydrogenase (quinone), mitochondrial
Synonyms:
DHODH Dihydroorotate dehydrogenase Dihydroorotate dehydrogenase, mitochondrial Dihydroorotate oxidase (DHODH) | PYRD_HUMAN
Type:
Enzyme
Mol. Mass.:
42881.33
Organism:
Homo sapiens (Human)
Description:
Q02127
Residue:
395
  
Inhibitor
Name:
BDBM50576022
Synonyms:
CHEMBL1498496
Type:
Small organic molecule
Emp. Form.:
C22H27NO2
Mol. Mass.:
337.4553
SMILES:
COc1cc2CCCCc2cc1NC(=O)c1ccc(cc1)C(C)(C)C
: