Target
C-C chemokine receptor type 5
Ligand
BDBM50143756
Substrate
Meas. Tech.
ChEMBL_39497 (CHEMBL656492)
IC50
2.2±n/a nM
Citation
 Thoma, GNuninger, FSchaefer, MAkyel, KGAlbert, RBeerli, CBruns, CFrancotte, ELuyten, MMacKenzie, DOberer, LStreiff, MBWagner, TWalter, HWeckbecker, GZerwes, HG Orally bioavailable competitive CCR5 antagonists. J Med Chem 47:1939-55 (2004)  
Target
Name:
C-C chemokine receptor type 5
Synonyms:
C-C CKR-5 CC-CKR-5 CCR5 CCR5_HUMAN CHEMR13 HIV-1 fusion coreceptor
Type:
Enzyme
Mol. Mass.:
40540.21
Organism:
Homo sapiens (Human)
Description:
P51681
Residue:
352
  
Inhibitor
Name:
BDBM50143756
Synonyms:
(4,6-Dimethyl-pyrimidin-5-yl)-(4-diphenylamino-4'-methyl-[1,4']bipiperidinyl-1'-yl)-methanone CHEMBL61424
Type:
Small organic molecule
Emp. Form.:
C30H37N5O
Mol. Mass.:
483.6477
SMILES:
Cc1ncnc(C)c1C(=O)N1CCC(C)(CC1)N1CCC(CC1)N(c1ccccc1)c1ccccc1
: