Target
Complement C1s subcomponent
Ligand
BDBM50147051
Substrate
Meas. Tech.
ChEBML_48032
Ki
330±n/a nM
Citation
 Subasinghe, NLAli, FIllig, CRJonathan Rudolph, MKlein, SKhalil, ESoll, RMBone, RFSpurlino, JCDesJarlais, RLCrysler, CSCummings, MDMorris, PEKilpatrick, JMSudhakara Babu, Y A novel series of potent and selective small molecule inhibitors of the complement component C1s. Bioorg Med Chem Lett 14:3043-7 (2004)  
Target
Name:
Complement C1s subcomponent
Synonyms:
C1 esterase C1S_HUMAN Complement C1s subcomponent Complement C1s subcomponent light chain Trypsin | complement component 1, s subcomponent
Type:
Protein
Mol. Mass.:
76657.91
Organism:
Homo sapiens (Human)
Description:
P09871
Residue:
688
  
Inhibitor
Name:
BDBM50147051
Synonyms:
4-[4-(1-Methyl-5-propyl-1H-pyrazol-4-yl)-thiazol-2-yl]-5-methylsulfanyl-thiophene-2-carboxamidine | CHEMBL318576
Type:
Small organic molecule
Emp. Form.:
C16H19N5S3
Mol. Mass.:
377.551
SMILES:
CCCc1c(cnn1C)-c1csc(n1)-c1cc(sc1SC)C(N)=N
: