Target
Interleukin-17A
Ligand
BDBM50581141
Substrate
Meas. Tech.
ChEMBL_2149819 (CHEMBL5034281)
IC50
<100±n/a nM
Citation
 Ko?trun, SFajdeti?, APe?i?, DBraj?a, KBenceti? Mihaljevi?, VJeli?, DPetrini? Grba, AElenkov, IRup?i?, RKapi?, SOzimec Landek, IButkovi?, KGrgi?evi?, A?iher, D?iko?, APadovan, JSaxty, GDack, KBladh, HSkak-Nielsen, TFeldbaek Nielsen, SLambert, MStahlhut, M Macrolide Inspired Macrocycles as Modulators of the IL-17A/IL-17RA Interaction. J Med Chem 64:8354-8383 (2021)  
Target
Name:
Interleukin-17A
Synonyms:
CTLA8 IL-17 IL17A il-17a
Type:
Enzyme Catalytic Domain
Mol. Mass.:
17511.44
Organism:
Homo sapiens (Human)
Description:
Q16552
Residue:
155
  
Inhibitor
Name:
BDBM50581141
Synonyms:
CHEMBL5075374
Type:
Small organic molecule
Emp. Form.:
C38H43ClF2N4O4
Mol. Mass.:
693.222
SMILES:
FC(F)(C(=O)N[C@@H](Cc1ccccc1Cl)C(=O)Nc1ccc(CCNC(=O)CC2(CC(=O)N3CCCC3)CCCC2)cc1)c1ccccc1
: