Target
Peroxisome proliferator-activated receptor alpha
Ligand
BDBM28700
Substrate
Meas. Tech.
ChEMBL_304321 (CHEMBL829293)
EC50
>10000±n/a nM
Citation
 Martín, JABrooks, DAPrieto, LGonzález, RTorrado, ARojo, ILópez de Uralde, BLamas, CFerritto, RDolores Martín-Ortega, MAgejas, JParra, FRizzo, JRRhodes, GARobey, RLAlt, CAWendel, SRZhang, TYReifel-Miller, AMontrose-Rafizadeh, CBrozinick, JTHawkins, EMisener, EABriere, DAArdecky, RFraser, JDWarshawsky, AM 2-Alkoxydihydrocinnamates as PPAR agonists. Activity modulation by the incorporation of phenoxy substituents. Bioorg Med Chem Lett 15:51-5 (2004)  
Target
Name:
Peroxisome proliferator-activated receptor alpha
Synonyms:
NR1C1 PPAR PPAR-alpha PPARA_HUMAN Peroxisome proliferator-activated receptor | Peroxisome proliferator-activated receptor alpha (PPAR alpha)
Type:
Enzyme
Mol. Mass.:
52222.08
Organism:
Homo sapiens (Human)
Description:
Q07869
Residue:
468
  
Inhibitor
Name:
BDBM28700
Synonyms:
2-(4-(4-Chlorobenzoyl)phenoxy)-2-methylpropionic acid CHEMBL981 FIBRICOR LF 153 procetofenic acid
Type:
Small organic molecule
Emp. Form.:
C17H15ClO4
Mol. Mass.:
318.752
SMILES:
CC(C)(Oc1ccc(cc1)C(=O)c1ccc(Cl)cc1)C(O)=O
: