Target
Estrogen receptor
Ligand
BDBM50157142
Substrate
Meas. Tech.
ChEMBL_305993 (CHEMBL832667)
IC50
0.7±n/a nM
Citation
 Blizzard, TADininno, FMorgan, JDChen, HYWu, JYKim, SChan, WBirzin, ETYang, YTPai, LYFitzgerald, PMSharma, NLi, YZhang, ZHayes, ECDasilva, CATang, WRohrer, SPSchaeffer, JMHammond, ML Estrogen receptor ligands. Part 9: Dihydrobenzoxathiin SERAMs with alkyl substituted pyrrolidine side chains and linkers. Bioorg Med Chem Lett 15:107-13 (2004)  
Target
Name:
Estrogen receptor
Synonyms:
ER ESR ESR1_HUMAN Estrogen receptor Estrogen receptor (ER-alpha) Estrogen receptor alpha (ER) Nuclear receptor subfamily 3 group A member 1
Type:
Protein
Mol. Mass.:
66230.44
Organism:
Homo sapiens (Human)
Description:
P03372
Residue:
595
  
Inhibitor
Name:
BDBM50157142
Synonyms:
(2S,3R)-3-(4-Hydroxy-phenyl)-2-{4-[2-((R)-2-methyl-pyrrolidin-1-yl)-ethoxy]-phenyl}-2,3-dihydro-benzo[1,4]oxathiin-6-ol | CHEMBL183489
Type:
Small organic molecule
Emp. Form.:
C27H29NO4S
Mol. Mass.:
463.588
SMILES:
C[C@@H]1CCCN1CCOc1ccc(cc1)[C@@H]1Oc2ccc(O)cc2S[C@@H]1c1ccc(O)cc1
: