Target
Adenosine receptor A2a
Ligand
BDBM50086170
Substrate
Meas. Tech.
ChEMBL_303499 (CHEMBL839971)
Ki
>260±n/a nM
Citation
 Zablocki, JKalla, RPerry, TPalle, VVarkhedkar, VXiao, DPiscopio, AMaa, TGimbel, AHao, JChu, NLeung, KZeng, D The discovery of a selective, high affinity A(2B) adenosine receptor antagonist for the potential treatment of asthma. Bioorg Med Chem Lett 15:609-12 (2005)  
Target
Name:
Adenosine receptor A2a
Synonyms:
A2A adenosine receptor (hA2A) ADENOSINE A2 ADORA2 Adenosine A2A receptor (A2AAR)
Type:
G Protein-Coupled Receptor (GPCR)
Mol. Mass.:
44716.46
Organism:
Homo sapiens (Human)
Description:
P29274
Residue:
412
  
Inhibitor
Name:
BDBM50086170
Synonyms:
(4-Cyano-phenyl)-carbamic acid 4-(2,6-dioxo-1,3-dipropyl-2,3,6,7-tetrahydro-1H-purin-8-yl)-phenyl ester CHEMBL273807 N-(4-Cyano-phenyl)-2-[4-(2,6-dioxo-1,3-dipropyl-2,3,6,7-tetrahydro-1H-purin-8-yl)-phenoxy]-acetamide(MRS-1754) | N-(4-cyanophenyl)-2-(4-(2,6-dioxo-1,3-dipropyl-2,3,6,7-tetrahydro-1H-purin-8-yl)phenoxy)acetamide
Type:
Small organic molecule
Emp. Form.:
C26H26N6O4
Mol. Mass.:
486.5224
SMILES:
CCCn1c2nc([nH]c2c(=O)n(CCC)c1=O)-c1ccc(OCC(=O)Nc2ccc(cc2)C#N)cc1
: