Target
Cell division protein FtsZ
Ligand
BDBM50589185
Substrate
Meas. Tech.
ChEMBL_2192536 (CHEMBL5104896)
Kd
600±n/a nM
Citation
 Du, RLSun, NFung, YHZheng, YYChen, YWChan, PHWong, WLWong, KY Discovery of FtsZ inhibitors by virtual screening as antibacterial agents and study of the inhibition mechanism. RSC Med Chem 13:79-89 (2022) Target
Name:
Cell division protein FtsZ
Synonyms:
FTSZ_STAAU | ftsZ
Type:
Protein
Mol. Mass.:
41023.36
Organism:
Staphylococcus aureus
Description:
P0A031
Residue:
390
  
Inhibitor
Name:
BDBM50589185
Synonyms:
CHEMBL5199894
Type:
Small organic molecule
Emp. Form.:
C23H23ClFN5O2
Mol. Mass.:
455.912
SMILES:
COc1cc2ncnc(Nc3ccc(F)c(Cl)c3)c2cc1NC(=O)\C=C\N1CCCCC1
: