Target
D(1A) dopamine receptor
Ligand
BDBM50162957
Substrate
Meas. Tech.
ChEMBL_303123 (CHEMBL829632)
Ki
5.2±n/a nM
Citation
 Fernández, JAlonso, JMAndrés, JICid, JMDíaz, AIturrino, LGil, PMegens, ASipido, VKTrabanco, AA Discovery of new tetracyclic tetrahydrofuran derivatives as potential broad-spectrum psychotropic agents. J Med Chem 48:1709-12 (2005)  
Target
Name:
D(1A) dopamine receptor
Synonyms:
DA D1 receptor DRD1 Dopamine D1 receptor Dopamine D1A
Type:
Enzyme
Mol. Mass.:
49303.43
Organism:
Homo sapiens (Human)
Description:
P21728
Residue:
446
  
Inhibitor
Name:
BDBM50162957
Synonyms:
(11-Fluoro-2,3,3a,12b-tetrahydro-1-oxa-8-thia-dibenzo[e,h]azulen-2-ylmethyl)-dimethyl-amine | CHEMBL193639
Type:
Small organic molecule
Emp. Form.:
C19H20FNOS
Mol. Mass.:
329.432
SMILES:
CN(C)C[C@H]1CC2[C@H](O1)c1cc(F)ccc1Sc1ccccc21
: