Target
Potassium voltage-gated channel subfamily KQT member 4
Ligand
BDBM50592356
Substrate
Meas. Tech.
ChEMBL_2203875 (CHEMBL5116583)
EC50
910±n/a nM
Citation
 Hernandez, CCTarfa, RAMiguel I Limcaoco, JLiu, RMondal, PHill, CKeith Duncan, RTzounopoulos, TStephenson, CRJO'Meara, MJWipf, P Development of an automated screen for Kv7.2 potassium channels and discovery of a new agonist chemotype. Bioorg Med Chem Lett 71:0 (2022) Target
Name:
Potassium voltage-gated channel subfamily KQT member 4
Synonyms:
KCNQ (Kv7) potassium channel KCNQ4_HUMAN Potassium channel subunit alpha KvLQT4 Voltage-gated potassium channel subunit Kv7.4
Type:
PROTEIN
Mol. Mass.:
77131.10
Organism:
Homo sapiens (Human)
Description:
ChEMBL_1520985
Residue:
695
  
Inhibitor
Name:
BDBM50592356
Synonyms:
CHEMBL4458793
Type:
Small organic molecule
Emp. Form.:
C18H17F4N3O2
Mol. Mass.:
383.3401
SMILES:
Nc1c(F)c(NCc2ccc(cc2)C(F)(F)F)ccc1NC(=O)OC1CC1
: