Target
Estrogen receptor beta
Ligand
BDBM50174926
Substrate
Meas. Tech.
ChEMBL_325825 (CHEMBL863237)
IC50
2.6±n/a nM
Citation
 Blizzard, TAMorgan, JDChan, WBirzin, ETPai, LYHayes, ECDaSilva, CAMosley, RTYang, YTRohrer, SPDininno, FHammond, ML Estrogen receptor ligands. Part 14: application of novel antagonist side chains to existing platforms. Bioorg Med Chem Lett 15:5124-8 (2005)  
Target
Name:
Estrogen receptor beta
Synonyms:
ER-beta ESR2_HUMAN Estradiol receptor beta (ERβ) Estrogen receptor (ER beta) Estrogen receptor beta (ER beta) NR3A2 estrogen beta
Type:
Protein
Mol. Mass.:
59238.43
Organism:
Homo sapiens (Human)
Description:
Q92731
Residue:
530
  
Inhibitor
Name:
BDBM50174926
Synonyms:
(S)-(6-hydroxy-2-(4-hydroxyphenyl)benzo[b]thiophen-3-yl)(4-(2-(pyrrolidin-1-yl)propoxy)phenyl)methanone | CHEMBL198803
Type:
Small organic molecule
Emp. Form.:
C28H27NO4S
Mol. Mass.:
473.583
SMILES:
C[C@@H](COc1ccc(cc1)C(=O)c1c(sc2cc(O)ccc12)-c1ccc(O)cc1)N1CCCC1
: