Target
Programmed cell death protein 4
Ligand
BDBM50598483
Substrate
Meas. Tech.
ChEMBL_2227009 (CHEMBL5140522)
EC50
2251±n/a nM
Citation
 Peng, THe, YWang, TYu, JMa, XZhou, ZSheng, YLi, LPeng, HLi, SZou, JYuan, YZhao, YShi, HLi, FLiu, WHu, KLu, XZhang, GWang, F Discovery of a Novel Small-Molecule Inhibitor Disrupting TRBP-Dicer Interaction against Hepatocellular Carcinoma via the Modulation of microRNA Biogenesis. J Med Chem 65:11010-11033 (2022) Target
Name:
Programmed cell death protein 4
Synonyms:
H731 Nuclear antigen H731-like PDCD4_HUMAN | Protein 197/15a
Type:
PROTEIN
Mol. Mass.:
51720.55
Organism:
Homo sapiens (Human)
Description:
ChEMBL_776474
Residue:
469
  
Inhibitor
Name:
BDBM50598483
Synonyms:
CHEMBL5170759
Type:
Small organic molecule
Emp. Form.:
C14H15NO4
Mol. Mass.:
261.2732
SMILES:
CCOC(=O)c1nc(oc1C)-c1ccc(OC)cc1
: