Target
C-C chemokine receptor type 4
Ligand
BDBM50175665
Substrate
Meas. Tech.
ChEMBL_329115 (CHEMBL863431)
IC50
10±n/a nM
Citation
 Purandare, AVWan, HGao, ASomerville, JBurke, CVaccaro, WYang, XMcIntyre, KWPoss, MA Optimization of CCR4 antagonists: side-chain exploration. Bioorg Med Chem Lett 16:204-7 (2005)  
Target
Name:
C-C chemokine receptor type 4
Synonyms:
C-C CKR-4 C-C chemokine receptor type 4 (CCR4) CCR-4 CCR4_HUMAN CMKBR4 | K5-5
Type:
Enzyme
Mol. Mass.:
41406.41
Organism:
Homo sapiens (Human)
Description:
P51679
Residue:
360
  
Inhibitor
Name:
BDBM50175665
Synonyms:
(R)-(4-(4-(2,4-dichlorobenzylamino)pyrimidin-2-yl)piperazin-1-yl)(piperidin-2-yl)methanone | CHEMBL372399
Type:
Small organic molecule
Emp. Form.:
C21H26Cl2N6O
Mol. Mass.:
449.377
SMILES:
Clc1ccc(CNc2ccnc(n2)N2CCN(CC2)C(=O)[C@H]2CCCCN2)c(Cl)c1
: