Target
Type 1 fimbrin D-mannose specific adhesin
Ligand
BDBM50467903
Substrate
Meas. Tech.
ChEMBL_2227373 (CHEMBL5140886)
Kd
2300±n/a nM
Citation
 Singh, KKulkarni, SS Small Carbohydrate Derivatives as Potent Antibiofilm Agents. J Med Chem 65:8525-8549 (2022) Target
Name:
Type 1 fimbrin D-mannose specific adhesin
Synonyms:
Adhesin protein fimH fimH
Type:
PROTEIN
Mol. Mass.:
31474.61
Organism:
Escherichia coli (strain K12)
Description:
ChEMBL_1298296
Residue:
300
  
Inhibitor
Name:
BDBM50467903
Synonyms:
CHEBI:28729 | CHEMBL365590
Type:
Small organic molecule
Emp. Form.:
C6H12O6
Mol. Mass.:
180.1559
SMILES:
OC[C@H]1O[C@H](O)[C@@H](O)[C@@H](O)[C@@H]1O
: