Target
Phosphatidylinositol 4-phosphate 5-kinase type-1 beta
Ligand
BDBM50178832
Substrate
Meas. Tech.
ChEMBL_2231146 (CHEMBL5144918)
IC50
1000±n/a nM
Citation
 Andrews, DMCartic, SCosulich, SDivecha, NFaulder, PFlemington, VKern, OKettle, JGMacDonald, EMcKelvie, JPike, KGRoberts, BRowlinson, RSmith, JMStockley, MSwarbrick, METreinies, IWaring, MJ Identification and optimization of a novel series of selective PIP5K inhibitors. Bioorg Med Chem 54:0 (2022) Target
Name:
Phosphatidylinositol 4-phosphate 5-kinase type-1 beta
Synonyms:
2.7.1.68 PIP5K1-beta PIP5KIbeta Protein STM-7 STM7 Type I phosphatidylinositol 4-phosphate 5-kinase beta
Type:
PROTEIN
Mol. Mass.:
61038.12
Organism:
Homo sapiens
Description:
ChEMBL_120312
Residue:
540
  
Inhibitor
Name:
BDBM50178832
Synonyms:
CHEMBL203535 N-(4-(2-(phenylamino)pyridin-4-yl)pyridin-2-yl)-tetrahydrofuran-3-carboxamide
Type:
Small organic molecule
Emp. Form.:
C21H20N4O2
Mol. Mass.:
360.4091
SMILES:
O=C(Nc1cc(ccn1)-c1ccnc(Nc2ccccc2)c1)C1CCOC1
: