Target
Phosphatidylinositol 4-phosphate 5-kinase type-1 beta
Ligand
BDBM50599596
Substrate
Meas. Tech.
ChEMBL_2231146 (CHEMBL5144918)
IC50
35±n/a nM
Citation
 Andrews, DMCartic, SCosulich, SDivecha, NFaulder, PFlemington, VKern, OKettle, JGMacDonald, EMcKelvie, JPike, KGRoberts, BRowlinson, RSmith, JMStockley, MSwarbrick, METreinies, IWaring, MJ Identification and optimization of a novel series of selective PIP5K inhibitors. Bioorg Med Chem 54:0 (2022) Target
Name:
Phosphatidylinositol 4-phosphate 5-kinase type-1 beta
Synonyms:
2.7.1.68 PIP5K1-beta PIP5KIbeta Protein STM-7 STM7 Type I phosphatidylinositol 4-phosphate 5-kinase beta
Type:
PROTEIN
Mol. Mass.:
61038.12
Organism:
Homo sapiens
Description:
ChEMBL_120312
Residue:
540
  
Inhibitor
Name:
BDBM50599596
Synonyms:
CHEMBL5191668
Type:
Small organic molecule
Emp. Form.:
C25H26N4O3
Mol. Mass.:
430.4989
SMILES:
CC(=O)Nc1cc(Nc2ccccc2)cc(c1)-c1ccnc(NC(=O)C2CCOCC2)c1
: