Target
DNA-dependent protein kinase catalytic subunit
Ligand
BDBM50156495
Substrate
Meas. Tech.
ChEMBL_326726 (CHEMBL858719)
Ki
0.650000±n/a nM
Citation
 Hardcastle, IRCockcroft, XCurtin, NJEl-Murr, MDLeahy, JJStockley, MGolding, BTRigoreau, LRichardson, CSmith, GCGriffin, RJ Discovery of potent chromen-4-one inhibitors of the DNA-dependent protein kinase (DNA-PK) using a small-molecule library approach. J Med Chem 48:7829-46 (2005)  
Target
Name:
DNA-dependent protein kinase catalytic subunit
Synonyms:
DNA-PK catalytic subunit DNA-dependent protein kinase (DNA-PK) DNA-dependent protein kinase catalytic subunit (DNA-PK) HYRC PRKDC | PRKDC_HUMAN
Type:
Protein
Mol. Mass.:
469114.78
Organism:
Homo sapiens (Human)
Description:
P78527
Residue:
4128
  
Inhibitor
Name:
BDBM50156495
Synonyms:
8-(dibenzo[b,d]thiophen-4-yl)-2-morpholino-4H-chromen-4-one 8-dibenzothiophen-1-yl-2-morpholin-4-yl-chromen-4-one NU-7432 | NU-7441
Type:
Small organic molecule
Emp. Form.:
C25H19NO3S
Mol. Mass.:
413.488
SMILES:
O=c1cc(oc2c(cccc12)-c1cccc2c3ccccc3sc12)N1CCOCC1
: