Target
Potassium voltage-gated channel subfamily H member 2
Ligand
BDBM50179777
Substrate
Meas. Tech.
ChEMBL_336038 (CHEMBL865929)
Ki
984±n/a nM
Citation
 Hollingworth, GJCarlson, EJCastro, JLChicchi, GGClark, NCooper, LCDirat, OSalvo, JDElliott, JMKilburn, RKurtz, MMRycroft, WTattersall, FDTsao, KLSwain, CJ Novel lactam NK1 antagonists with anti-emetic activity. Bioorg Med Chem Lett 16:1197-201 (2006)  
Target
Name:
Potassium voltage-gated channel subfamily H member 2
Synonyms:
1,3-beta-glucan synthase component GLS2 ERG Eag-related protein 1 Ether-a-go-go-related gene (HERG) Ether-a-go-go-related gene potassium channel 1 Ether-a-go-go-related gene potassium channel 1 (hERG1) Ether-a-go-go-related protein 1 H-ERG KCNH2 Potassium voltage-gated channel subfamily H member 2 (hERG) Voltage-gated potassium channel subunit Kv11.1 hERG Potassium Channel 1 | putative potassium channel subunit
Type:
Multi-pass membrane protein
Mol. Mass.:
126672.65
Organism:
Homo sapiens (Human)
Description:
Q12809
Residue:
1159
  
Inhibitor
Name:
BDBM50179777
Synonyms:
3-(3,5-bis(trifluoromethyl)phenyl)-1-((1r,4r)-4-(dimethylamino)-1-phenylcyclohexyl)pyrrolidin-2-one | CHEMBL203700
Type:
Small organic molecule
Emp. Form.:
C26H28F6N2O
Mol. Mass.:
498.5037
SMILES:
CN(C)[C@H]1CC[C@@](CC1)(N1CCC(C1=O)c1cc(cc(c1)C(F)(F)F)C(F)(F)F)c1ccccc1
: