Target
Melanin-concentrating hormone receptor 1
Ligand
BDBM50193700
Substrate
Meas. Tech.
ChEMBL_421373 (CHEMBL856555)
IC50
0.50±n/a nM
Citation
 Jiang, JHoang, MYoung, JRChaung, DEid, RTurner, CLin, PTong, XWang, JTan, CFeighner, SPalyha, OHreniuk, DLPan, JSailer, AWMacNeil, DJHoward, AShearman, LStribling, SCamacho, RStrack, AVan der Ploeg, LHGoulet, MTDeVita, RJ 2-Aminoquinoline melanin-concentrating hormone (MCH)1R antagonists. Bioorg Med Chem Lett 16:5270-4 (2006)  
Target
Name:
Melanin-concentrating hormone receptor 1
Synonyms:
G-protein coupled receptor 24 MCH receptor 1 MCH-R1 MCHR-1 MCHR1_HUMAN Melanin-Concentrating Hormone Receptor 1 (MCH1R) Melanin-concentrating hormone receptor 1 (MCH-1) Melanin-concentrating hormone receptor 1 (MCHR-1) SLC-1 Somatostatin receptor-like protein
Type:
G Protein-Coupled Receptor (GPCR)
Mol. Mass.:
45976.27
Organism:
Homo sapiens (Human)
Description:
Membranes from CHO-K1 cells stably expressing human MCH1R were used in assays.
Residue:
422
  
Inhibitor
Name:
BDBM50193700
Synonyms:
CHEMBL217502 | N-(2-(2,7-diazaspiro[4.4]nonan-2-yl)quinolin-6-yl)-3-(4-(trifluoromethyl)phenyl)propanamide
Type:
Small organic molecule
Emp. Form.:
C26H27F3N4O
Mol. Mass.:
468.514
SMILES:
FC(F)(F)c1ccc(CCC(=O)Nc2ccc3nc(ccc3c2)N2CCC3(CCNC3)C2)cc1
: