Target
Peroxisome proliferator-activated receptor gamma
Ligand
BDBM50194953
Substrate
Meas. Tech.
ChEMBL_424616 (CHEMBL855678)
EC50
6±n/a nM
Citation
 Humphries, PSBailey, SAlmaden, JVBarnum, SJCarlson, TJChristie, LCDo, QQFraser, JDHess, MKellum, JKim, YHMcClellan, GAOgilvie, KMSimmons, BHSkalitzky, DSun, SWilhite, DZehnder, LR Pyridine-3-propanoic acids: Discovery of dual PPARalpha/gamma agonists as antidiabetic agents. Bioorg Med Chem Lett 16:6120-3 (2006)  
Target
Name:
Peroxisome proliferator-activated receptor gamma
Synonyms:
NR1C3 PPAR-gamma PPARG_HUMAN Peroxisome proliferator-activated receptor gamma (PPAR gamma) Peroxisome proliferator-activated receptor gamma (PPARĪ³) peroxisome proliferator-activated receptor gamma isoform 2
Type:
Nuclear Receptor
Mol. Mass.:
57613.46
Organism:
Homo sapiens (Human)
Description:
P37231
Residue:
505
  
Inhibitor
Name:
BDBM50194953
Synonyms:
2-ethoxy-3-(6-(2-(5-methyl-2-phenyloxazol-4-yl)ethoxy)pyridin-3-yl)propanoic acid | CHEMBL220597
Type:
Small organic molecule
Emp. Form.:
C22H24N2O5
Mol. Mass.:
396.4364
SMILES:
CCOC(Cc1ccc(OCCc2nc(oc2C)-c2ccccc2)nc1)C(O)=O
: