Target
Peroxisome proliferator-activated receptor gamma
Ligand
BDBM50194978
Substrate
Meas. Tech.
ChEMBL_424612 (CHEMBL853963)
Ki
17000±n/a nM
Citation
 Humphries, PSBailey, SAlmaden, JVBarnum, SJCarlson, TJChristie, LCDo, QQFraser, JDHess, MKellum, JKim, YHMcClellan, GAOgilvie, KMSimmons, BHSkalitzky, DSun, SWilhite, DZehnder, LR Pyridine-3-propanoic acids: Discovery of dual PPARalpha/gamma agonists as antidiabetic agents. Bioorg Med Chem Lett 16:6120-3 (2006)  
Target
Name:
Peroxisome proliferator-activated receptor gamma
Synonyms:
NR1C3 PPAR-gamma PPARG_HUMAN Peroxisome proliferator-activated receptor gamma (PPAR gamma) Peroxisome proliferator-activated receptor gamma (PPARĪ³) peroxisome proliferator-activated receptor gamma isoform 2
Type:
Nuclear Receptor
Mol. Mass.:
57613.46
Organism:
Homo sapiens (Human)
Description:
P37231
Residue:
505
  
Inhibitor
Name:
BDBM50194978
Synonyms:
3-((6-(2-(5-methyl-2-phenyloxazol-4-yl)ethoxy)pyridin-3-yl)methyl)-tetrahydrofuran-3-carboxylic acid | CHEMBL222171
Type:
Small organic molecule
Emp. Form.:
C23H24N2O5
Mol. Mass.:
408.4471
SMILES:
Cc1oc(nc1CCOc1ccc(CC2(CCOC2)C(O)=O)cn1)-c1ccccc1
: