Target
Estrogen receptor beta
Ligand
BDBM50204796
Substrate
Meas. Tech.
ChEMBL_454489 (CHEMBL886515)
IC50
161±n/a nM
Citation
 Dykstra, KDGuo, LBirzin, ETChan, WYang, YTHayes, ECDaSilva, CAPai, LYMosley, RTKraker, BFitzgerald, PMDiNinno, FRohrer, SPSchaeffer, JMHammond, ML Estrogen receptor ligands. Part 16: 2-Aryl indoles as highly subtype selective ligands for ERalpha. Bioorg Med Chem Lett 17:2322-8 (2007)  
Target
Name:
Estrogen receptor beta
Synonyms:
ER-beta ESR2_HUMAN Estradiol receptor beta (ERβ) Estrogen receptor (ER beta) Estrogen receptor beta (ER beta) NR3A2 estrogen beta
Type:
Protein
Mol. Mass.:
59238.43
Organism:
Homo sapiens (Human)
Description:
Q92731
Residue:
530
  
Inhibitor
Name:
BDBM50204796
Synonyms:
(R)-2-(1-(4-(4-(piperidin-1-yl)butoxy)benzyl)-2-phenyl-1H-indol-3-yl)-N-(4-(4-hydroxyphenyl)butan-2-yl)acetamide | CHEMBL396119
Type:
Small organic molecule
Emp. Form.:
C42H49N3O3
Mol. Mass.:
643.8568
SMILES:
C[C@H](CCc1ccc(O)cc1)NC(=O)Cc1c(-c2ccccc2)n(Cc2ccc(OCCCCN3CCCCC3)cc2)c2ccccc12
: