Target
Amyloid-beta precursor protein
Ligand
BDBM50220297
Substrate
Meas. Tech.
ChEMBL_449193 (CHEMBL899458)
IC50
0.3±n/a nM
Citation
 Josien, HBara, TRajagopalan, MAsberom, TClader, JWFavreau, LGreenlee, WJHyde, LANomeir, AAParker, EMPissarnitski, DASong, LWong, GTZhang, LZhang, QZhao, Z Small conformationally restricted piperidine N-arylsulfonamides as orally active gamma-secretase inhibitors. Bioorg Med Chem Lett 17:5330-5 (2007)  
Target
Name:
Amyloid-beta precursor protein
Synonyms:
A4 ABPP AICD-50 AICD-59 AID(57) APP Alzheimer disease amyloid protein Amyloid beta Protein Amyloid beta protein Abeta(1-42) Amyloid intracellular domain 57 Amyloid protein (Abeta42b) Beta amyloid A4 protein Beta-APP42 Beta-amyloid protein 42 C83 CVAP Gamma Secretase Gamma-CTF(57) Gamma-secretase Gamma-secretase C-terminal fragment 57 P3(40) PN-II Protease nexin-II S-APP-beta Soluble APP-beta | beta-Amyloid Precursor Protein (APP)
Type:
Single-pass type I membrane protein
Mol. Mass.:
86890.41
Organism:
Homo sapiens (Human)
Description:
P05067
Residue:
770
  
Inhibitor
Name:
BDBM50220297
Synonyms:
1-((2R,6S)-1-(4-chlorophenylsulfonyl)-6-(3,5-difluorophenyl)piperidin-2-yl)cyclopropyl 4-(piperidin-1-yl)piperidine-1-carboxylate | CHEMBL240055
Type:
Small organic molecule
Emp. Form.:
C31H38ClF2N3O4S
Mol. Mass.:
622.166
SMILES:
Fc1cc(F)cc(c1)[C@@H]1CCC[C@@H](N1S(=O)(=O)c1ccc(Cl)cc1)C1(CC1)OC(=O)N1CCC(CC1)N1CCCCC1
: