Target
Beta-secretase 1
Ligand
BDBM50226456
Substrate
Meas. Tech.
ChEMBL_451977 (CHEMBL901135)
IC50
34000±n/a nM
Citation
 Edwards, PDAlbert, JSSylvester, MAharony, DAndisik, DCallaghan, OCampbell, JBCarr, RAChessari, GCongreve, MFrederickson, MFolmer, RHGeschwindner, SKoether, GKolmodin, KKrumrine, JMauger, RCMurray, CWOlsson, LLPatel, SSpear, NTian, G Application of fragment-based lead generation to the discovery of novel, cyclic amidine beta-secretase inhibitors with nanomolar potency, cellular activity, and high ligand efficiency. J Med Chem 50:5912-25 (2007)  
Target
Name:
Beta-secretase 1
Synonyms:
ASP2 Aspartyl protease 2 BACE1 Beta-secretase (BACE) Beta-secretase 1 (BACE 1) Beta-secretase 1 (BACE1) Beta-site amyloid precursor protein cleaving enzyme 1 Memapsin-2 beta-Secretase (BACE-1) | beta-Secretase (BACE1)
Type:
Protein
Mol. Mass.:
55755.10
Organism:
Homo sapiens (Human)
Description:
P56817
Residue:
501
  
Inhibitor
Name:
BDBM50226456
Synonyms:
2-amino-3,6-dimethyl-6-phenethyl-5,6-dihydropyrimidin-4(3H)-one | CHEMBL239639
Type:
Small organic molecule
Emp. Form.:
C14H19N3O
Mol. Mass.:
245.3202
SMILES:
CN1C(=O)CC(C)(CCc2ccccc2)N=C1N
: