Target
Peptidyl-prolyl cis-trans isomerase FKBP1A
Ligand
BDBM50228092
Substrate
Meas. Tech.
ChEMBL_452413 (CHEMBL902649)
Kd
>3000000±n/a nM
Citation
 Stebbins, JLZhang, ZChen, JWu, BEmdadi, AWilliams, MECashman, JPellecchia, M Nuclear magnetic resonance fragment-based identification of novel FKBP12 inhibitors. J Med Chem 50:6607-17 (2007)  
Target
Name:
Peptidyl-prolyl cis-trans isomerase FKBP1A
Synonyms:
12 kDa FK506-binding protein FK506-binding protein 1A FKB1A_HUMAN FKBP-1A FKBP12 Immunophilin FKBP12 PPIase FKBP1A Rotamase mTOR/FKBP12A/FKBP12B
Type:
Isomerase
Mol. Mass.:
11953.09
Organism:
Homo sapiens (Human)
Description:
P62942
Residue:
108
  
Inhibitor
Name:
BDBM50228092
Synonyms:
1-(3-(trifluoromethyl)benzyl)-2-(thiazol-4-yl)-1H-benzo[d]imidazole | CHEMBL393825
Type:
Small organic molecule
Emp. Form.:
C18H12F3N3S
Mol. Mass.:
359.368
SMILES:
FC(F)(F)c1cccc(Cn2c(nc3ccccc23)-c2cscn2)c1
: