Target
Peptidyl-prolyl cis-trans isomerase FKBP1A
Ligand
BDBM50228121
Substrate
Meas. Tech.
ChEMBL_452413 (CHEMBL902649)
Kd
453000±n/a nM
Citation
 Stebbins, JLZhang, ZChen, JWu, BEmdadi, AWilliams, MECashman, JPellecchia, M Nuclear magnetic resonance fragment-based identification of novel FKBP12 inhibitors. J Med Chem 50:6607-17 (2007)  
Target
Name:
Peptidyl-prolyl cis-trans isomerase FKBP1A
Synonyms:
12 kDa FK506-binding protein FK506-binding protein 1A FKB1A_HUMAN FKBP-1A FKBP12 Immunophilin FKBP12 PPIase FKBP1A Rotamase mTOR/FKBP12A/FKBP12B
Type:
Isomerase
Mol. Mass.:
11953.09
Organism:
Homo sapiens (Human)
Description:
P62942
Residue:
108
  
Inhibitor
Name:
BDBM50228121
Synonyms:
2-(2-morpholino-2-oxoethylthio)-5-(trifluoromethyl)benzoic acid | CHEMBL237192
Type:
Small organic molecule
Emp. Form.:
C14H14F3NO4S
Mol. Mass.:
349.325
SMILES:
OC(=O)c1cc(ccc1SCC(=O)N1CCOCC1)C(F)(F)F
: